Reaction Details
TargetMuscarinic acetylcholine receptor M3
LigandBDBM50194658
Substrate/Competitorn/a
Meas. Tech.ChEMBL_395698 (CHEMBL909206)
Ki 0.17±n/a nM
Citation Sagara, YSagara, TUchiyama, MOtsuki, SKimura, TFujikawa, TNoguchi, KOhtake, N Identification of a novel 4-aminomethylpiperidine class of M3 muscarinic receptor antagonists and structural insight into their M3 selectivity. J Med Chem49:5653-63 (2006) 
 
Muscarinic acetylcholine receptor M3
Name:Muscarinic acetylcholine receptor M3
Type:Enzyme
Mol. Mass.:66151.03
Organism:Homo sapiens (Human)
Description:P20309
Residue:590
BDBM50194658
NameBDBM50194658
Synonyms:(2R)-N-(1-cyclopropylmethyl-4-piperidinylmethyl)-1-((2S,4R)-4-hydroxy-1 -[3,3,3-tris(4-fluorophenyl)propanoyl]pyrrolidine-2-yl)carbonylpyrrolidine-2-carboxamide | CHEMBL378772
TypeSmall organic molecule
Emp. Form.C41H47F3N4O4
Mol. Mass.716.8315
SMILESO[C@@H]1C[C@H](N(C1)C(=O)CC(c1ccc(F)cc1)(c1ccc(F)cc1)c1ccc(F)cc1)C(=O)N1CCC[C@@H]1C(=O)NCC1CCN(CC2CC2)CC1