Reaction Details
TargetTyrosine-protein kinase JAK3
LigandBDBM50194676
Substrate/Competitorn/a
Meas. Tech.ChEMBL_396626 (CHEMBL853499)
IC50 1141±n/a nM
Citation DiMauro, EFNewcomb, JNunes, JJBemis, JEBoucher, CBuchanan, JLBuckner, WHCee, VJChai, LDeak, HLEpstein, LFFaust, TGallant, PGeuns-Meyer, SDGore, AGu, YHenkle, BHodous, BLHsieh, FHuang, XKim, JLLee, JHMartin, MWMasse, CEMcGowan, DCMetz, DMohn, DMorgenstern, KAOliveira-dos-Santos, APatel, VFPowers, DRose, PESchneider, STomlinson, SATudor, YYTurci, SMWelcher, AAWhite, RDZhao, HZhu, LZhu, X Discovery of aminoquinazolines as potent, orally bioavailable inhibitors of Lck: synthesis, SAR, and in vivo anti-inflammatory activity. J Med Chem49:5671-86 (2006) 
 
Tyrosine-protein kinase JAK3
Name:Tyrosine-protein kinase JAK3
Type:Protein
Mol. Mass.:125111.08
Organism:Homo sapiens (Human)
Description:P52333
Residue:1124
BDBM50194676
NameBDBM50194676
Synonyms:1-(4-methyl-3-(2-(methylamino)quinazolin-6-yl)phenyl)-3-(3-(trifluoromethyl)phenyl)urea | CHEMBL424719
TypeSmall organic molecule
Emp. Form.C24H20F3N5O
Mol. Mass.451.4437
SMILESCNc1ncc2cc(ccc2n1)-c1cc(NC(=O)Nc2cccc(c2)C(F)(F)F)ccc1C