Reaction Details
TargetTyrosine-protein kinase Lck
LigandBDBM50194683
Substrate/Competitorn/a
Meas. Tech.ChEMBL_396621 (CHEMBL913225)
IC50 0.500000±n/a nM
Citation DiMauro, EFNewcomb, JNunes, JJBemis, JEBoucher, CBuchanan, JLBuckner, WHCee, VJChai, LDeak, HLEpstein, LFFaust, TGallant, PGeuns-Meyer, SDGore, AGu, YHenkle, BHodous, BLHsieh, FHuang, XKim, JLLee, JHMartin, MWMasse, CEMcGowan, DCMetz, DMohn, DMorgenstern, KAOliveira-dos-Santos, APatel, VFPowers, DRose, PESchneider, STomlinson, SATudor, YYTurci, SMWelcher, AAWhite, RDZhao, HZhu, LZhu, X Discovery of aminoquinazolines as potent, orally bioavailable inhibitors of Lck: synthesis, SAR, and in vivo anti-inflammatory activity. J Med Chem49:5671-86 (2006) 
 
Tyrosine-protein kinase Lck
Name:Tyrosine-protein kinase Lck
Type:n/a
Mol. Mass.:57987.83
Organism:Homo sapiens (Human)
Description:P06239
Residue:509
BDBM50194683
NameBDBM50194683
Synonyms:CHEMBL212953 N-{2-[(N,N-DIETHYLGLYCYL)AMINO]-5-(TRIFLUOROMETHYL)PHENYL}-4-METHYL-3-[2-(METHYLAMINO)QUINAZOLIN-6-YL]BENZAMIDE
TypeSmall organic molecule
Emp. Form.C30H31F3N6O2
Mol. Mass.564.6013
SMILESCCN(CC)CC(=O)Nc1ccc(cc1NC(=O)c1ccc(C)c(c1)-c1ccc2nc(NC)ncc2c1)C(F)(F)F