Reaction Details
TargetVascular endothelial growth factor receptor 2
LigandBDBM50194668
Substrate/Competitorn/a
Meas. Tech.ChEMBL_396624 (CHEMBL853495)
IC50 1±n/a nM
Citation DiMauro, EFNewcomb, JNunes, JJBemis, JEBoucher, CBuchanan, JLBuckner, WHCee, VJChai, LDeak, HLEpstein, LFFaust, TGallant, PGeuns-Meyer, SDGore, AGu, YHenkle, BHodous, BLHsieh, FHuang, XKim, JLLee, JHMartin, MWMasse, CEMcGowan, DCMetz, DMohn, DMorgenstern, KAOliveira-dos-Santos, APatel, VFPowers, DRose, PESchneider, STomlinson, SATudor, YYTurci, SMWelcher, AAWhite, RDZhao, HZhu, LZhu, X Discovery of aminoquinazolines as potent, orally bioavailable inhibitors of Lck: synthesis, SAR, and in vivo anti-inflammatory activity. J Med Chem49:5671-86 (2006) 
 
Vascular endothelial growth factor receptor 2
Name:Vascular endothelial growth factor receptor 2
Type:Receptor Tyrosine Kinase
Mol. Mass.:151510.97
Organism:Homo sapiens (Human)
Description:P35968
Residue:1356
BDBM50194668
NameBDBM50194668
Synonyms:4-methyl-3-(2-(2-morpholinoethylamino)quinazolin-6-yl)-N-(3-(trifluoromethyl)phenyl)benzamide | CHEMBL215943
TypeSmall organic molecule
Emp. Form.C29H28F3N5O2
Mol. Mass.535.5601
SMILESCc1ccc(cc1-c1ccc2nc(NCCN3CCOCC3)ncc2c1)C(=O)Nc1cccc(c1)C(F)(F)F