Reaction Details
TargetTyrosine-protein kinase JAK3
LigandBDBM50194679
Substrate/Competitorn/a
Meas. Tech.ChEMBL_396626 (CHEMBL853499)
IC50 557±n/a nM
Citation DiMauro, EFNewcomb, JNunes, JJBemis, JEBoucher, CBuchanan, JLBuckner, WHCee, VJChai, LDeak, HLEpstein, LFFaust, TGallant, PGeuns-Meyer, SDGore, AGu, YHenkle, BHodous, BLHsieh, FHuang, XKim, JLLee, JHMartin, MWMasse, CEMcGowan, DCMetz, DMohn, DMorgenstern, KAOliveira-dos-Santos, APatel, VFPowers, DRose, PESchneider, STomlinson, SATudor, YYTurci, SMWelcher, AAWhite, RDZhao, HZhu, LZhu, X Discovery of aminoquinazolines as potent, orally bioavailable inhibitors of Lck: synthesis, SAR, and in vivo anti-inflammatory activity. J Med Chem49:5671-86 (2006) 
 
Tyrosine-protein kinase JAK3
Name:Tyrosine-protein kinase JAK3
Type:Protein
Mol. Mass.:125111.08
Organism:Homo sapiens (Human)
Description:P52333
Residue:1124
BDBM50194679
NameBDBM50194679
Synonyms:3-(2-aminoquinazolin-6-yl)-4-methyl-N-(2-methyl-3-(trifluoromethyl)phenyl)benzamide | CHEMBL215813
TypeSmall organic molecule
Emp. Form.C24H19F3N4O
Mol. Mass.436.4291
SMILESCc1ccc(cc1-c1ccc2nc(N)ncc2c1)C(=O)Nc1cccc(c1C)C(F)(F)F