Reaction Details
TargetVascular endothelial growth factor receptor 2
LigandBDBM50194685
Substrate/Competitorn/a
Meas. Tech.ChEMBL_396624 (CHEMBL853495)
IC50 360±n/a nM
Citation DiMauro, EFNewcomb, JNunes, JJBemis, JEBoucher, CBuchanan, JLBuckner, WHCee, VJChai, LDeak, HLEpstein, LFFaust, TGallant, PGeuns-Meyer, SDGore, AGu, YHenkle, BHodous, BLHsieh, FHuang, XKim, JLLee, JHMartin, MWMasse, CEMcGowan, DCMetz, DMohn, DMorgenstern, KAOliveira-dos-Santos, APatel, VFPowers, DRose, PESchneider, STomlinson, SATudor, YYTurci, SMWelcher, AAWhite, RDZhao, HZhu, LZhu, X Discovery of aminoquinazolines as potent, orally bioavailable inhibitors of Lck: synthesis, SAR, and in vivo anti-inflammatory activity. J Med Chem49:5671-86 (2006) 
 
Vascular endothelial growth factor receptor 2
Name:Vascular endothelial growth factor receptor 2
Type:Receptor Tyrosine Kinase
Mol. Mass.:151510.97
Organism:Homo sapiens (Human)
Description:P35968
Residue:1356
BDBM50194685
NameBDBM50194685
Synonyms:CHEMBL385055 | N-(2-(3,3-dimethyl-2-oxoazetidin-1-yl)-5-(trifluoromethyl)phenyl)-4-methyl-3-(2-(methylamino)quinazolin-6-yl)benzamide
TypeSmall organic molecule
Emp. Form.C29H26F3N5O2
Mol. Mass.533.5442
SMILESCNc1ncc2cc(ccc2n1)-c1cc(ccc1C)C(=O)Nc1cc(ccc1N1CC(C)(C)C1=O)C(F)(F)F