Reaction Details
TargetMitogen-activated protein kinase 14
LigandBDBM50194681
Substrate/Competitorn/a
Meas. Tech.ChEMBL_396625 (CHEMBL853498)
IC50 14±n/a nM
Citation DiMauro, EFNewcomb, JNunes, JJBemis, JEBoucher, CBuchanan, JLBuckner, WHCee, VJChai, LDeak, HLEpstein, LFFaust, TGallant, PGeuns-Meyer, SDGore, AGu, YHenkle, BHodous, BLHsieh, FHuang, XKim, JLLee, JHMartin, MWMasse, CEMcGowan, DCMetz, DMohn, DMorgenstern, KAOliveira-dos-Santos, APatel, VFPowers, DRose, PESchneider, STomlinson, SATudor, YYTurci, SMWelcher, AAWhite, RDZhao, HZhu, LZhu, X Discovery of aminoquinazolines as potent, orally bioavailable inhibitors of Lck: synthesis, SAR, and in vivo anti-inflammatory activity. J Med Chem49:5671-86 (2006) 
 
Mitogen-activated protein kinase 14
Name:Mitogen-activated protein kinase 14
Type:Serine/threonine-protein kinase
Mol. Mass.:41286.76
Organism:Homo sapiens (Human)
Description:Q16539
Residue:360
BDBM50194681
NameBDBM50194681
Synonyms:CHEMBL215019 | N-(4-chloro-3-(trifluoromethyl)phenyl)-4-methyl-3-(2-(methylamino)quinazolin-6-yl)benzamide
TypeSmall organic molecule
Emp. Form.C24H18ClF3N4O
Mol. Mass.470.874
SMILESCNc1ncc2cc(ccc2n1)-c1cc(ccc1C)C(=O)Nc1ccc(Cl)c(c1)C(F)(F)F