Reaction Details
TargetTyrosine-protein kinase Lck
LigandBDBM50194699
Substrate/Competitorn/a
Meas. Tech.ChEMBL_396621 (CHEMBL913225)
IC50 200±n/a nM
Citation DiMauro, EFNewcomb, JNunes, JJBemis, JEBoucher, CBuchanan, JLBuckner, WHCee, VJChai, LDeak, HLEpstein, LFFaust, TGallant, PGeuns-Meyer, SDGore, AGu, YHenkle, BHodous, BLHsieh, FHuang, XKim, JLLee, JHMartin, MWMasse, CEMcGowan, DCMetz, DMohn, DMorgenstern, KAOliveira-dos-Santos, APatel, VFPowers, DRose, PESchneider, STomlinson, SATudor, YYTurci, SMWelcher, AAWhite, RDZhao, HZhu, LZhu, X Discovery of aminoquinazolines as potent, orally bioavailable inhibitors of Lck: synthesis, SAR, and in vivo anti-inflammatory activity. J Med Chem49:5671-86 (2006) 
 
Tyrosine-protein kinase Lck
Name:Tyrosine-protein kinase Lck
Type:n/a
Mol. Mass.:57987.83
Organism:Homo sapiens (Human)
Description:P06239
Residue:509
BDBM50194699
NameBDBM50194699
Synonyms:3-(2-aminoquinazolin-6-yl)-2-methyl-N-(3-(trifluoromethyl)phenyl)benzamide | CHEMBL215892
TypeSmall organic molecule
Emp. Form.C23H17F3N4O
Mol. Mass.422.4025
SMILESCc1c(cccc1-c1ccc2nc(N)ncc2c1)C(=O)Nc1cccc(c1)C(F)(F)F