Reaction Details
TargetMitogen-activated protein kinase 14
LigandBDBM50194677
Substrate/Competitorn/a
Meas. Tech.ChEMBL_396625 (CHEMBL853498)
IC50 65±n/a nM
Citation DiMauro, EFNewcomb, JNunes, JJBemis, JEBoucher, CBuchanan, JLBuckner, WHCee, VJChai, LDeak, HLEpstein, LFFaust, TGallant, PGeuns-Meyer, SDGore, AGu, YHenkle, BHodous, BLHsieh, FHuang, XKim, JLLee, JHMartin, MWMasse, CEMcGowan, DCMetz, DMohn, DMorgenstern, KAOliveira-dos-Santos, APatel, VFPowers, DRose, PESchneider, STomlinson, SATudor, YYTurci, SMWelcher, AAWhite, RDZhao, HZhu, LZhu, X Discovery of aminoquinazolines as potent, orally bioavailable inhibitors of Lck: synthesis, SAR, and in vivo anti-inflammatory activity. J Med Chem49:5671-86 (2006) 
 
Mitogen-activated protein kinase 14
Name:Mitogen-activated protein kinase 14
Type:Serine/threonine-protein kinase
Mol. Mass.:41286.76
Organism:Homo sapiens (Human)
Description:Q16539
Residue:360
BDBM50194677
NameBDBM50194677
Synonyms:4-methyl-3-(2-(methyl(3-morpholinopropyl)amino)quinazolin-6-yl)-N-(2-methyl-3-(trifluoromethyl)phenyl)benzamide | CHEMBL212195
TypeSmall organic molecule
Emp. Form.C32H34F3N5O2
Mol. Mass.577.6399
SMILESCN(CCCN1CCOCC1)c1ncc2cc(ccc2n1)-c1cc(ccc1C)C(=O)Nc1cccc(c1C)C(F)(F)F