Reaction Details
TargetVascular endothelial growth factor receptor 2
LigandBDBM50194686
Substrate/Competitorn/a
Meas. Tech.ChEMBL_396624 (CHEMBL853495)
IC50 47±n/a nM
Citation DiMauro, EFNewcomb, JNunes, JJBemis, JEBoucher, CBuchanan, JLBuckner, WHCee, VJChai, LDeak, HLEpstein, LFFaust, TGallant, PGeuns-Meyer, SDGore, AGu, YHenkle, BHodous, BLHsieh, FHuang, XKim, JLLee, JHMartin, MWMasse, CEMcGowan, DCMetz, DMohn, DMorgenstern, KAOliveira-dos-Santos, APatel, VFPowers, DRose, PESchneider, STomlinson, SATudor, YYTurci, SMWelcher, AAWhite, RDZhao, HZhu, LZhu, X Discovery of aminoquinazolines as potent, orally bioavailable inhibitors of Lck: synthesis, SAR, and in vivo anti-inflammatory activity. J Med Chem49:5671-86 (2006) 
 
Vascular endothelial growth factor receptor 2
Name:Vascular endothelial growth factor receptor 2
Type:Receptor Tyrosine Kinase
Mol. Mass.:151510.97
Organism:Homo sapiens (Human)
Description:P35968
Residue:1356
BDBM50194686
NameBDBM50194686
Synonyms:1-(2-(4-methyl-3-(2-(methylamino)quinazolin-6-yl)benzamido)-4-(trifluoromethyl)phenyl)-3-(2-morpholinoethyl)urea | CHEMBL213831
TypeSmall organic molecule
Emp. Form.C31H32F3N7O3
Mol. Mass.607.6261
SMILESCNc1ncc2cc(ccc2n1)-c1cc(ccc1C)C(=O)Nc1cc(ccc1NC(=O)NCCN1CCOCC1)C(F)(F)F