Reaction Details
TargetTyrosine-protein kinase JAK3
LigandBDBM50194681
Substrate/Competitorn/a
Meas. Tech.ChEMBL_396626 (CHEMBL853499)
IC50 16±n/a nM
Citation DiMauro, EFNewcomb, JNunes, JJBemis, JEBoucher, CBuchanan, JLBuckner, WHCee, VJChai, LDeak, HLEpstein, LFFaust, TGallant, PGeuns-Meyer, SDGore, AGu, YHenkle, BHodous, BLHsieh, FHuang, XKim, JLLee, JHMartin, MWMasse, CEMcGowan, DCMetz, DMohn, DMorgenstern, KAOliveira-dos-Santos, APatel, VFPowers, DRose, PESchneider, STomlinson, SATudor, YYTurci, SMWelcher, AAWhite, RDZhao, HZhu, LZhu, X Discovery of aminoquinazolines as potent, orally bioavailable inhibitors of Lck: synthesis, SAR, and in vivo anti-inflammatory activity. J Med Chem49:5671-86 (2006) 
 
Tyrosine-protein kinase JAK3
Name:Tyrosine-protein kinase JAK3
Type:Protein
Mol. Mass.:125111.08
Organism:Homo sapiens (Human)
Description:P52333
Residue:1124
BDBM50194681
NameBDBM50194681
Synonyms:CHEMBL215019 | N-(4-chloro-3-(trifluoromethyl)phenyl)-4-methyl-3-(2-(methylamino)quinazolin-6-yl)benzamide
TypeSmall organic molecule
Emp. Form.C24H18ClF3N4O
Mol. Mass.470.874
SMILESCNc1ncc2cc(ccc2n1)-c1cc(ccc1C)C(=O)Nc1ccc(Cl)c(c1)C(F)(F)F