Reaction Details
TargetCoagulation factor X
LigandBDBM50194743
Substrate/Competitorn/a
Meas. Tech.ChEMBL_398433 (CHEMBL908012)
IC50 33000±n/a nM
Citation Joossens, JVan der Veken, PSurpateanu, GLambeir, AMEl-Sayed, IAli, OMAugustyns, KHaemers, A Diphenyl phosphonate inhibitors for the urokinase-type plasminogen activator: optimization of the P4 position. J Med Chem49:5785-93 (2006) 
 
Coagulation factor X
Name:Coagulation factor X
Type:PROTEIN
Mol. Mass.:54498.45
Organism:Bos taurus
Description:ChEMBL_1364435
Residue:492
BDBM50194743
NameBDBM50194743
Synonyms:CHEMBL214814 {2-(4-guanidino-phenyl)-1-[(S)-2-((R)-3-hydroxy-2-phenylmethanesulfonylamino-propionylamino)-propionylamino]-ethyl}-phosphonic acid diphenyl ester
TypeSmall organic molecule
Emp. Form.C34H39N6O8PS
Mol. Mass.722.748
SMILES[#6]-[#6@H](-[#7]-[#6](=O)-[#6@@H](-[#6]-[#8])-[#7]S(=O)(=O)[#6]-c1ccccc1)-[#6](=O)-[#7]-[#6](-[#6]-c1ccc(cc1)\[#7]=[#6](\[#7])-[#7])P(=O)([#8]-c1ccccc1)[#8]-c1ccccc1