Reaction Details
TargetMitogen-activated protein kinase 9
LigandBDBM50194868
Substrate/Competitorn/a
Meas. Tech.ChEMBL_424575 (CHEMBL853926)
IC50 30±n/a nM
Citation Liu, GZhao, HLiu, BXin, ZLiu, MKosogof, CSzczepankiewicz, BGWang, SClampit, JEGum, RJHaasch, DLTrevillyan, JMSham, HL Aminopyridine carboxamides as c-Jun N-terminal kinase inhibitors: targeting the gatekeeper residue and beyond. Bioorg Med Chem Lett16:5723-30 (2006) 
 
Mitogen-activated protein kinase 9
Name:Mitogen-activated protein kinase 9
Type:Enzyme
Mol. Mass.:48131.49
Organism:Homo sapiens (Human)
Description:JNK-2 was purchased from Upstate Cell Signaling Solutions (formerly Upstate Biotechnology).
Residue:424
BDBM50194868
NameBDBM50194868
Synonyms:(S)-N-(4-(methylsulfonyl)benzyl)-4-amino-5-cyano-6-(1-hydroxypropan-2-ylamino)picolinamide | CHEMBL221227
TypeSmall organic molecule
Emp. Form.C18H21N5O4S
Mol. Mass.403.455
SMILESC[C@@H](CO)Nc1nc(cc(N)c1C#N)C(=O)NCc1ccc(cc1)S(C)(=O)=O