Reaction Details
TargetPeroxisome proliferator-activated receptor gamma
LigandBDBM50194970
Substrate/Competitorn/a
Meas. Tech.ChEMBL_424612 (CHEMBL853963)
Ki 94±n/a nM
Citation Humphries, PSBailey, SAlmaden, JVBarnum, SJCarlson, TJChristie, LCDo, QQFraser, JDHess, MKellum, JKim, YHMcClellan, GAOgilvie, KMSimmons, BHSkalitzky, DSun, SWilhite, DZehnder, LR Pyridine-3-propanoic acids: Discovery of dual PPARalpha/gamma agonists as antidiabetic agents. Bioorg Med Chem Lett16:6120-3 (2006) 
 
Peroxisome proliferator-activated receptor gamma
Name:Peroxisome proliferator-activated receptor gamma
Type:Nuclear Receptor
Mol. Mass.:57613.46
Organism:Homo sapiens (Human)
Description:P37231
Residue:505
BDBM50194970
NameBDBM50194970
Synonyms:2-((6-(2-(5-methyl-2-(4-(trifluoromethyl)phenyl)oxazol-4-yl)ethoxy)pyridin-3-yl)methyl)-tetrahydrofuran-2-carboxylic acid | CHEMBL221641
TypeSmall organic molecule
Emp. Form.C24H23F3N2O5
Mol. Mass.476.445
SMILESCc1oc(nc1CCOc1ccc(CC2(CCCO2)C(O)=O)cn1)-c1ccc(cc1)C(F)(F)F