Reaction Details
TargetPeroxisome proliferator-activated receptor gamma
LigandBDBM50194957
Substrate/Competitorn/a
Meas. Tech.ChEMBL_424612 (CHEMBL853963)
Ki 7±n/a nM
Citation Humphries, PSBailey, SAlmaden, JVBarnum, SJCarlson, TJChristie, LCDo, QQFraser, JDHess, MKellum, JKim, YHMcClellan, GAOgilvie, KMSimmons, BHSkalitzky, DSun, SWilhite, DZehnder, LR Pyridine-3-propanoic acids: Discovery of dual PPARalpha/gamma agonists as antidiabetic agents. Bioorg Med Chem Lett16:6120-3 (2006) 
 
Peroxisome proliferator-activated receptor gamma
Name:Peroxisome proliferator-activated receptor gamma
Type:Nuclear Receptor
Mol. Mass.:57613.46
Organism:Homo sapiens (Human)
Description:P37231
Residue:505
BDBM50194957
NameBDBM50194957
Synonyms:2-((6-(2-(2-(3-methoxyphenyl)-5-methyloxazol-4-yl)ethoxy)pyridin-3-yl)methyl)-tetrahydrofuran-2-carboxylic acid | CHEMBL426550
TypeSmall organic molecule
Emp. Form.C24H26N2O6
Mol. Mass.438.473
SMILESCOc1cccc(c1)-c1nc(CCOc2ccc(CC3(CCCO3)C(O)=O)cn2)c(C)o1