Reaction Details
TargetMitogen-activated protein kinase kinase kinase 8
LigandBDBM50194991
Substrate/Competitorn/a
Meas. Tech.ChEMBL_424645 (CHEMBL855706)
IC50 30000±n/a nM
Citation Hu, YGreen, NGavrin, LKJanz, KKaila, NLi, HQThomason, JRCuozzo, JWHall, JPHsu, SNickerson-Nutter, CTelliez, JBLin, LLTam, S Inhibition of Tpl2 kinase and TNFalpha production with quinoline-3-carbonitriles for the treatment of rheumatoid arthritis. Bioorg Med Chem Lett16:6067-72 (2006) 
 
Mitogen-activated protein kinase kinase kinase 8
Name:Mitogen-activated protein kinase kinase kinase 8
Type:Serine/threonine-protein kinase
Mol. Mass.:52916.89
Organism:Homo sapiens (Human)
Description:P41279
Residue:467
BDBM50194991
NameBDBM50194991
Synonyms:4-(3-chloro-4-fluorophenylamino)-6-(pyrrolidin-2-ylmethylamino)quinoline-3-carbonitrile | CHEMBL220685
TypeSmall organic molecule
Emp. Form.C21H19ClFN5
Mol. Mass.395.86
SMILESFc1ccc(Nc2c(cnc3ccc(NCC4CCCN4)cc23)C#N)cc1Cl