Reaction Details
TargetMitogen-activated protein kinase kinase kinase 8
LigandBDBM21896
Substrate/Competitorn/a
Meas. Tech.ChEMBL_424645 (CHEMBL855706)
IC50 19±n/a nM
Citation Hu, YGreen, NGavrin, LKJanz, KKaila, NLi, HQThomason, JRCuozzo, JWHall, JPHsu, SNickerson-Nutter, CTelliez, JBLin, LLTam, S Inhibition of Tpl2 kinase and TNFalpha production with quinoline-3-carbonitriles for the treatment of rheumatoid arthritis. Bioorg Med Chem Lett16:6067-72 (2006) 
 
Mitogen-activated protein kinase kinase kinase 8
Name:Mitogen-activated protein kinase kinase kinase 8
Type:Serine/threonine-protein kinase
Mol. Mass.:52916.89
Organism:Homo sapiens (Human)
Description:P41279
Residue:467
BDBM21896
NameBDBM21896
Synonyms:4-[(3-chloro-4-fluorophenyl)amino]-6-[(1H-imidazol-4-ylmethyl)amino]quinoline-3-carbonitrile CHEMBL220037 | Cyanoquinoline, 2
TypeSmall organic molecule
Emp. Form.C20H14ClFN6
Mol. Mass.392.817
SMILESFc1ccc(Nc2c(cnc3ccc(NCc4cnc[nH]4)cc23)C#N)cc1Cl