Reaction Details
TargetMitogen-activated protein kinase kinase kinase 8
LigandBDBM50195006
Substrate/Competitorn/a
Meas. Tech.ChEMBL_424645 (CHEMBL855706)
IC50 14±n/a nM
Citation Hu, YGreen, NGavrin, LKJanz, KKaila, NLi, HQThomason, JRCuozzo, JWHall, JPHsu, SNickerson-Nutter, CTelliez, JBLin, LLTam, S Inhibition of Tpl2 kinase and TNFalpha production with quinoline-3-carbonitriles for the treatment of rheumatoid arthritis. Bioorg Med Chem Lett16:6067-72 (2006) 
 
Mitogen-activated protein kinase kinase kinase 8
Name:Mitogen-activated protein kinase kinase kinase 8
Type:Serine/threonine-protein kinase
Mol. Mass.:52916.89
Organism:Homo sapiens (Human)
Description:P41279
Residue:467
BDBM50195006
NameBDBM50195006
Synonyms:4-(3-chloro-4-fluorophenylamino)-6-((5-methyl-1-(2-morpholinoethyl)-1H-imidazol-4-yl)methylamino)quinoline-3-carbonitrile | CHEMBL219628
TypeSmall organic molecule
Emp. Form.C27H27ClFN7O
Mol. Mass.520.001
SMILESCc1c(CNc2ccc3ncc(C#N)c(Nc4ccc(F)c(Cl)c4)c3c2)ncn1CCN1CCOCC1