Reaction Details
TargetMitogen-activated protein kinase kinase kinase 8
LigandBDBM50195011
Substrate/Competitorn/a
Meas. Tech.ChEMBL_424645 (CHEMBL855706)
IC50 7000±n/a nM
Citation Hu, YGreen, NGavrin, LKJanz, KKaila, NLi, HQThomason, JRCuozzo, JWHall, JPHsu, SNickerson-Nutter, CTelliez, JBLin, LLTam, S Inhibition of Tpl2 kinase and TNFalpha production with quinoline-3-carbonitriles for the treatment of rheumatoid arthritis. Bioorg Med Chem Lett16:6067-72 (2006) 
 
Mitogen-activated protein kinase kinase kinase 8
Name:Mitogen-activated protein kinase kinase kinase 8
Type:Serine/threonine-protein kinase
Mol. Mass.:52916.89
Organism:Homo sapiens (Human)
Description:P41279
Residue:467
BDBM50195011
NameBDBM50195011
Synonyms:(R)-4-(3-chloro-4-fluorophenylamino)-6-((1-ethylpyrrolidin-2-yl)methylamino)quinoline-3-carbonitrile | CHEMBL426886
TypeSmall organic molecule
Emp. Form.C23H23ClFN5
Mol. Mass.423.914
SMILESCCN1CCC[C@@H]1CNc1ccc2ncc(C#N)c(Nc3ccc(F)c(Cl)c3)c2c1