Reaction Details
TargetMitogen-activated protein kinase kinase kinase 8
LigandBDBM50195013
Substrate/Competitorn/a
Meas. Tech.ChEMBL_424645 (CHEMBL855706)
IC50>40000±n/a nM
Citation Hu, YGreen, NGavrin, LKJanz, KKaila, NLi, HQThomason, JRCuozzo, JWHall, JPHsu, SNickerson-Nutter, CTelliez, JBLin, LLTam, S Inhibition of Tpl2 kinase and TNFalpha production with quinoline-3-carbonitriles for the treatment of rheumatoid arthritis. Bioorg Med Chem Lett16:6067-72 (2006) 
 
Mitogen-activated protein kinase kinase kinase 8
Name:Mitogen-activated protein kinase kinase kinase 8
Type:Serine/threonine-protein kinase
Mol. Mass.:52916.89
Organism:Homo sapiens (Human)
Description:P41279
Residue:467
BDBM50195013
NameBDBM50195013
Synonyms:6-((1H-imidazol-4-yl)methylamino)-4-(3-chloro-4-fluorophenylamino)-7-(trifluoromethoxy)quinoline-3-carbonitrile | CHEMBL374258
TypeSmall organic molecule
Emp. Form.C21H13ClF4N6O
Mol. Mass.476.814
SMILESFc1ccc(Nc2c(cnc3cc(OC(F)(F)F)c(NCc4cnc[nH]4)cc23)C#N)cc1Cl