Reaction Details
TargetPeroxisome proliferator-activated receptor alpha
LigandBDBM50195080
Substrate/Competitorn/a
Meas. Tech.ChEMBL_424737 (CHEMBL907889)
Ki 150±n/a nM
Citation Humphries, PSAlmaden, JVBarnum, SJCarlson, TJDo, QQFraser, JDHess, MKim, YHOgilvie, KMSun, S Pyridine-2-propanoic acids: Discovery of dual PPARalpha/gamma agonists as antidiabetic agents. Bioorg Med Chem Lett16:6116-9 (2006) 
 
Peroxisome proliferator-activated receptor alpha
Name:Peroxisome proliferator-activated receptor alpha
Type:Enzyme
Mol. Mass.:52222.08
Organism:Homo sapiens (Human)
Description:Q07869
Residue:468
BDBM50195080
NameBDBM50195080
Synonyms:2-((5-(2-(2-(4-chlorophenyl)-5-methyloxazol-4-yl)ethoxy)pyridin-2-yl)methyl)-tetrahydrofuran-2-carboxylic acid | CHEMBL375370
TypeSmall organic molecule
Emp. Form.C23H23ClN2O5
Mol. Mass.442.892
SMILESCc1oc(nc1CCOc1ccc(CC2(CCCO2)C(O)=O)nc1)-c1ccc(Cl)cc1