Reaction Details
Target11-beta-hydroxysteroid dehydrogenase 1
LigandBDBM50195289
Substrate/Competitorn/a
Meas. Tech.ChEMBL_424846 (CHEMBL907396)
Ki 2±n/a nM
Citation Sorensen, BRohde, JWang, JFung, SMonzon, KChiou, WPan, LDeng, XStolarik, DFrevert, EUJacobson, PLink, JT Adamantane 11-beta-HSD-1 inhibitors: Application of an isocyanide multicomponent reaction. Bioorg Med Chem Lett16:5958-62 (2006) 
 
11-beta-hydroxysteroid dehydrogenase 1
Name:11-beta-hydroxysteroid dehydrogenase 1
Type:Enzyme
Mol. Mass.:32409.16
Organism:Homo sapiens (Human)
Description:P28845
Residue:292
BDBM50195289
NameBDBM50195289
Synonyms:1-piperidin-1-yl-cyclopropanecarboxylic acid (5-hydroxy-adamantan-2-yl)-amide | CHEMBL220102
TypeSmall organic molecule
Emp. Form.C19H30N2O2
Mol. Mass.318.4537
SMILESO[C@@]12C[C@H]3CC(C1)[C@H](NC(=O)C1(CC1)N1CCCCC1)C(C3)C2