Reaction Details
TargetMitogen-activated protein kinase 1
LigandBDBM50195456
Substrate/Competitorn/a
Meas. Tech.ChEMBL_424982 (CHEMBL910739)
Kd 13000±n/a nM
Citation Chen, FHancock, CNMacias, ATJoh, JStill, KZhong, SMacKerell, ADShapiro, P Characterization of ATP-independent ERK inhibitors identified through in silico analysis of the active ERK2 structure. Bioorg Med Chem Lett16:6281-7 (2006) 
 
Mitogen-activated protein kinase 1
Name:Mitogen-activated protein kinase 1
Type:Ser/Thr Protein Kinase
Mol. Mass.:41392.76
Organism:Homo sapiens (Human)
Description:P28482
Residue:360
BDBM50195456
NameBDBM50195456
Synonyms:CHEMBL221271 N'-nitro-2-{[5-(3-nitrophenyl)-2-furyl]methylene}hydrazinecarboximidamide
TypeSmall organic molecule
Emp. Form.C12H10N6O5
Mol. Mass.318.245
SMILESNC(N=NCc1ccc(o1)-c1cccc(c1)[N+]([O-])=O)=N[N+]([O-])=O