Reaction Details
Target11-beta-hydroxysteroid dehydrogenase 1
LigandBDBM50195504
Substrate/Competitorn/a
Meas. Tech.ChEMBL_425004 (CHEMBL912529)
Ki 4±n/a nM
Citation Richards, SSorensen, BJae, HSWinn, MChen, YWang, JFung, SMonzon, KFrevert, EUJacobson, PSham, HLink, JT Discovery of potent and selective inhibitors of 11beta-HSD1 for the treatment of metabolic syndrome. Bioorg Med Chem Lett16:6241-5 (2006) 
 
11-beta-hydroxysteroid dehydrogenase 1
Name:11-beta-hydroxysteroid dehydrogenase 1
Type:Enzyme
Mol. Mass.:32409.16
Organism:Homo sapiens (Human)
Description:P28845
Residue:292
BDBM50195504
NameBDBM50195504
Synonyms:(4-amino-3,5-dichlorophenyl)(1,3,3-trimethyl-6-aza-bicyclo[3.2.1]octan-6-yl)methanone | CHEMBL376087
TypeSmall organic molecule
Emp. Form.C17H22Cl2N2O
Mol. Mass.341.275
SMILESCC12CC(CC(C)(C)C1)N(C2)C(=O)c1cc(Cl)c(N)c(Cl)c1