Reaction Details
Target11-beta-hydroxysteroid dehydrogenase type 2
LigandBDBM50195497
Substrate/Competitorn/a
Meas. Tech.ChEMBL_425006 (CHEMBL911426)
IC50>10000±n/a nM
Citation Richards, SSorensen, BJae, HSWinn, MChen, YWang, JFung, SMonzon, KFrevert, EUJacobson, PSham, HLink, JT Discovery of potent and selective inhibitors of 11beta-HSD1 for the treatment of metabolic syndrome. Bioorg Med Chem Lett16:6241-5 (2006) 
 
11-beta-hydroxysteroid dehydrogenase type 2
Name:11-beta-hydroxysteroid dehydrogenase type 2
Type:Enzyme
Mol. Mass.:44141.72
Organism:Homo sapiens (Human)
Description:Purified recombinant human 11beta-HSD2.
Residue:405
BDBM50195497
NameBDBM50195497
Synonyms:(4-amino-3,5-dichlorophenyl)((2R,6S)-4-(3-aminopyridin-2-yl)-2,6-dimethylpiperazin-1-yl)methanone | CHEMBL441553
TypeSmall organic molecule
Emp. Form.C18H21Cl2N5O
Mol. Mass.394.298
SMILESC[C@H]1CN(C[C@@H](C)N1C(=O)c1cc(Cl)c(N)c(Cl)c1)c1ncccc1N