Reaction Details
TargetUDP-N-acetylenolpyruvoylglucosamine reductase
LigandBDBM50195561
Substrate/Competitorn/a
Meas. Tech.ChEMBL_414256 (CHEMBL908330)
IC50 8700±n/a nM
Citation Gilbert, AMFailli, AShumsky, JYang, YSeverin, ASingh, GHu, WKeeney, DPetersen, PJKatz, AH Pyrazolidine-3,5-diones and 5-hydroxy-1H-pyrazol-3(2H)-ones, inhibitors of UDP-N-acetylenolpyruvyl glucosamine reductase. J Med Chem49:6027-36 (2006) 
 
UDP-N-acetylenolpyruvoylglucosamine reductase
Name:UDP-N-acetylenolpyruvoylglucosamine reductase
Type:Protein
Mol. Mass.:37848.05
Organism:Escherichia coli K-12 (Enterobacteria)
Description:E. coli MurB
Residue:342
BDBM50195561
NameBDBM50195561
Synonyms:1,2-bis(3-chlorophenyl)-5-hydroxy-3-oxo-2,3-dihydro-1H-pyrazole-4-carboxylic acid (4-trifluoromethylphenyl)amide | CHEMBL215061
TypeSmall organic molecule
Emp. Form.C23H14Cl2F3N3O3
Mol. Mass.508.277
SMILESOc1c(C(=O)Nc2ccc(cc2)C(F)(F)F)c(=O)n(-c2cccc(Cl)c2)n1-c1cccc(Cl)c1