Reaction Details
TargetUDP-N-acetylenolpyruvoylglucosamine reductase
LigandBDBM50195576
Substrate/Competitorn/a
Meas. Tech.ChEMBL_414256 (CHEMBL908330)
IC50 4800±n/a nM
Citation Gilbert, AMFailli, AShumsky, JYang, YSeverin, ASingh, GHu, WKeeney, DPetersen, PJKatz, AH Pyrazolidine-3,5-diones and 5-hydroxy-1H-pyrazol-3(2H)-ones, inhibitors of UDP-N-acetylenolpyruvyl glucosamine reductase. J Med Chem49:6027-36 (2006) 
 
UDP-N-acetylenolpyruvoylglucosamine reductase
Name:UDP-N-acetylenolpyruvoylglucosamine reductase
Type:Protein
Mol. Mass.:37848.05
Organism:Escherichia coli K-12 (Enterobacteria)
Description:E. coli MurB
Residue:342
BDBM50195576
NameBDBM50195576
Synonyms:1,2-bis(3,4-dichlorophenyl)-5-hydroxy-3-oxo-2,3-dihydro-1Hpyrazole-4-carboxylic acid (3,4-dichlorophenyl)amide | CHEMBL217323
TypeSmall organic molecule
Emp. Form.C22H11Cl6N3O3
Mol. Mass.578.059
SMILESOc1c(C(=O)Nc2ccc(Cl)c(Cl)c2)c(=O)n(-c2ccc(Cl)c(Cl)c2)n1-c1ccc(Cl)c(Cl)c1