Reaction Details
TargetUDP-N-acetylenolpyruvoylglucosamine reductase
LigandBDBM50195583
Substrate/Competitorn/a
Meas. Tech.ChEMBL_414256 (CHEMBL908330)
IC50 12200±n/a nM
Citation Gilbert, AMFailli, AShumsky, JYang, YSeverin, ASingh, GHu, WKeeney, DPetersen, PJKatz, AH Pyrazolidine-3,5-diones and 5-hydroxy-1H-pyrazol-3(2H)-ones, inhibitors of UDP-N-acetylenolpyruvyl glucosamine reductase. J Med Chem49:6027-36 (2006) 
 
UDP-N-acetylenolpyruvoylglucosamine reductase
Name:UDP-N-acetylenolpyruvoylglucosamine reductase
Type:Protein
Mol. Mass.:37848.05
Organism:Escherichia coli K-12 (Enterobacteria)
Description:E. coli MurB
Residue:342
BDBM50195583
NameBDBM50195583
Synonyms:1,2-bis(4-chlorophenyl)-5-hydroxy-3-oxo-2,3-dihydro-1H-pyrazole-4-carboxylic acid (2-chlorophenyl)amide | CHEMBL216194
TypeSmall organic molecule
Emp. Form.C22H13Cl3N2O3
Mol. Mass.459.709
SMILESOc1c(C(=O)c2ccccc2Cl)c(=O)n(-c2ccc(Cl)cc2)n1-c1ccc(Cl)cc1