Reaction Details
TargetHistone deacetylase
LigandBDBM19149
Substrate/Competitorn/a
Meas. Tech.ChEMBL_416719 (CHEMBL909985)
IC50 28±n/a nM
Citation Mai, AMassa, SRotili, DSimeoni, SRagno, RBotta, GNebbioso, AMiceli, MAltucci, LBrosch, G Synthesis and biological properties of novel, uracil-containing histone deacetylase inhibitors. J Med Chem49:6046-56 (2006) 
 
Histone deacetylase
Name:Histone deacetylase
Synonyms:Histone deacetylase HD1B
Type:PROTEIN
Mol. Mass.:50930.01
Organism:Zea mays
Description:ChEMBL_422128
Residue:458
BDBM19149
NameBDBM19149
TypeSmall organic molecule
Emp. Form.C14H20N2O3
Mol. Mass.264.3202
SMILESONC(=O)CCCCCCC(=O)Nc1ccccc1