Reaction Details
TargetHistone deacetylase 2b
LigandBDBM50195605
Substrate/Competitorn/a
Meas. Tech.ChEMBL_416717 (CHEMBL909983)
IC50 17±n/a nM
Citation Mai, AMassa, SRotili, DSimeoni, SRagno, RBotta, GNebbioso, AMiceli, MAltucci, LBrosch, G Synthesis and biological properties of novel, uracil-containing histone deacetylase inhibitors. J Med Chem49:6046-56 (2006) 
 
Histone deacetylase 2b
Name:Histone deacetylase 2b
Synonyms:Histone deacetylase HD2
Type:PROTEIN
Mol. Mass.:30785.07
Organism:Zea mays
Description:ChEMBL_87549
Residue:286
BDBM50195605
NameBDBM50195605
TypeSmall organic molecule
Emp. Form.C20H17N3O3S
Mol. Mass.379.432
SMILESONC(=O)C=Cc1cccc(CSc2nc(cc(=O)[nH]2)-c2ccccc2)c1