Reaction Details
TargetHistone deacetylase
LigandBDBM50195606
Substrate/Competitorn/a
Meas. Tech.ChEMBL_416719 (CHEMBL909985)
IC50 58±n/a nM
Citation Mai, AMassa, SRotili, DSimeoni, SRagno, RBotta, GNebbioso, AMiceli, MAltucci, LBrosch, G Synthesis and biological properties of novel, uracil-containing histone deacetylase inhibitors. J Med Chem49:6046-56 (2006) 
 
Histone deacetylase
Name:Histone deacetylase
Synonyms:Histone deacetylase HD1B
Type:PROTEIN
Mol. Mass.:50930.01
Organism:Zea mays
Description:ChEMBL_422128
Residue:458
BDBM50195606
NameBDBM50195606
TypeSmall organic molecule
Emp. Form.C23H25N3O3S
Mol. Mass.423.528
SMILESONC(=O)CCCCCSc1nc(cc(=O)[nH]1)C(c1ccccc1)c1ccccc1