Reaction Details
TargetHistone deacetylase
LigandBDBM50234055
Substrate/Competitorn/a
Meas. Tech.ChEMBL_416719 (CHEMBL909985)
IC50 10±n/a nM
Citation Mai, AMassa, SRotili, DSimeoni, SRagno, RBotta, GNebbioso, AMiceli, MAltucci, LBrosch, G Synthesis and biological properties of novel, uracil-containing histone deacetylase inhibitors. J Med Chem49:6046-56 (2006) 
 
Histone deacetylase
Name:Histone deacetylase
Synonyms:Histone deacetylase HD1B
Type:PROTEIN
Mol. Mass.:50930.01
Organism:Zea mays
Description:ChEMBL_422128
Residue:458
BDBM50234055
NameBDBM50234055
TypeSmall organic molecule
Emp. Form.C15H17N3O3S
Mol. Mass.319.379
SMILESONC(=O)CCCCSc1nc(cc(=O)[nH]1)-c1ccccc1