Reaction Details
TargetCycloartenol-C-24-methyltransferase
LigandBDBM50195629
Substrate/Competitorn/a
Meas. Tech.ChEMBL_415082 (CHEMBL912396)
IC50>100000±n/a nM
Citation Gros, LLorente, SOJimenez, CJYardley, VRattray, LWharton, HLittle, SCroft, SLRuiz-Perez, LMGonzalez-Pacanowska, DGilbert, IH Evaluation of azasterols as anti-parasitics. J Med Chem49:6094-103 (2006) 
 
Cycloartenol-C-24-methyltransferase
Name:Cycloartenol-C-24-methyltransferase
Type:PROTEIN
Mol. Mass.:38266.01
Organism:Arabidopsis thaliana
Description:ChEMBL_415082
Residue:336
BDBM50195629
NameBDBM50195629
Synonyms:3beta-acetoxy-23,24-bisnor-5-en-22-(3-(2-Boc-amino)propanoic acid) amine | CHEMBL217554
TypeSmall organic molecule
Emp. Form.C32H52N2O6
Mol. Mass.560.7651
SMILESC[C@H](CNC[C@H](NC(=O)OC(C)(C)C)C(O)=O)[C@H]1CC[C@H]2C3CC=C4C[C@H](CC[C@]4(C)[C@H]3CC[C@]12C)OC(C)=O