Reaction Details
TargetCholinesterase
LigandBDBM10692
Substrate/Competitorn/a
Meas. Tech.ChEMBL_431878 (CHEMBL915961)
IC50 48±n/a nM
Citation Piazzi, LBelluti, FBisi, AGobbi, SRizzo, SBartolini, MAndrisano, VRecanatini, MRampa, A Cholinesterase inhibitors: SAR and enzyme inhibitory activity of 3-[omega-(benzylmethylamino)alkoxy]xanthen-9-ones. Bioorg Med Chem15:575-85 (2006) 
 
Cholinesterase
Name:Cholinesterase
Type:Homotetramer
Mol. Mass.:68422.27
Organism:Homo sapiens (Human)
Description:P06276
Residue:602
BDBM10692
NameBDBM10692
Synonyms:3-{[methyl({3-[(9-oxo-9H-xanthen-3-yl)oxy]propyl})amino]methyl}phenyl N-methylcarbamate Xanthostigmine | aminoalkoxyheteroaryl deriv. 8
TypeSmall organic molecule
Emp. Form.C26H26N2O5
Mol. Mass.446.495
SMILESCNC(=O)Oc1cccc(CN(C)CCCOc2ccc3c(c2)oc2ccccc2c3=O)c1