Reaction Details
TargetEphrin type-B receptor 4
LigandBDBM50195876
Substrate/Competitorn/a
Meas. Tech.ChEMBL_452960 (CHEMBL902105)
IC50 0.4±n/a nM
Citation Miyazaki, YNakano, MSato, HTruesdale, ATStuart, JDNartey, ENHightower, KEKane-Carson, L Design and effective synthesis of novel templates, 3,7-diphenyl-4-amino-thieno and furo-[3,2-c]pyridines as protein kinase inhibitors and in vitro evaluation targeting angiogenetic kinases. Bioorg Med Chem Lett17:250-4 (2006) 
 
Ephrin type-B receptor 4
Name:Ephrin type-B receptor 4
Type:Enzyme
Mol. Mass.:108273.51
Organism:Homo sapiens (Human)
Description:P54760
Residue:987
BDBM50195876
NameBDBM50195876
Synonyms:3-(4-amino-3-{4-[3-(2-fluoro-5-trifluoromethyl-phenyl)-ureido]-phenyl}-furo[3,2-c]pyridin-7-yl)-benzenesulfonamide | CHEMBL241682
TypeSmall organic molecule
Emp. Form.C27H19F4N5O4S
Mol. Mass.585.529
SMILESNc1ncc(-c2cccc(c2)S(N)(=O)=O)c2occ(-c3ccc(NC(=O)Nc4cc(ccc4F)C(F)(F)F)cc3)c12