Reaction Details
TargetAdenosine receptor A1
LigandBDBM50196002
Substrate/Competitorn/a
Meas. Tech.ChEMBL_431897 (CHEMBL917395)
Ki 1.15±n/a nM
Citation Giorgi, IBianucci, AMBiagi, GLivi, OScartoni, VLeonardi, MPietra, DCoi, AMassarelli, INofal, FAFiamingo, FLAnastasi, PGiannini, G Synthesis, biological activity and molecular modelling of new trisubstituted 8-azaadenines with high affinity for A1 adenosine receptors. Eur J Med Chem42:1-9 (2007) 
 
Adenosine receptor A1
Name:Adenosine receptor A1
Type:Enzyme Catalytic Domain
Mol. Mass.:36602.99
Organism:BOVINE
Description:ADENOSINE 0 BOVINE::P28190
Residue:326
BDBM50196002
NameBDBM50196002
Synonyms:3-(2-fluorobenzyl)-N-cyclohexyl-5-phenyl-3H-[1,2,3]triazolo[4,5-d]pyrimidin-7-amine | CHEMBL227772
TypeSmall organic molecule
Emp. Form.C23H23FN6
Mol. Mass.402.4673
SMILESFc1ccccc1Cn1nnc2c(NC3CCCCC3)nc(nc12)-c1ccccc1