Reaction Details
TargetAdenosine receptor A1
LigandBDBM50196029
Substrate/Competitorn/a
Meas. Tech.ChEMBL_431897 (CHEMBL917395)
Ki 33±n/a nM
Citation Giorgi, IBianucci, AMBiagi, GLivi, OScartoni, VLeonardi, MPietra, DCoi, AMassarelli, INofal, FAFiamingo, FLAnastasi, PGiannini, G Synthesis, biological activity and molecular modelling of new trisubstituted 8-azaadenines with high affinity for A1 adenosine receptors. Eur J Med Chem42:1-9 (2007) 
 
Adenosine receptor A1
Name:Adenosine receptor A1
Type:Enzyme Catalytic Domain
Mol. Mass.:36602.99
Organism:BOVINE
Description:ADENOSINE 0 BOVINE::P28190
Residue:326
BDBM50196029
NameBDBM50196029
Synonyms:3-(3-(2-chlorobenzyl)-5-phenyl-3H-[1,2,3]triazolo[4,5-d]pyrimidin-7-ylamino)propan-1-ol | CHEMBL224274
TypeSmall organic molecule
Emp. Form.C20H19ClN6O
Mol. Mass.394.857
SMILESOCCCNc1nc(nc2n(Cc3ccccc3Cl)nnc12)-c1ccccc1