Reaction Details
TargetInduced myeloid leukemia cell differentiation protein Mcl-1
LigandBDBM50196032
Substrate/Competitorn/a
Meas. Tech.ChEMBL_416891 (CHEMBL909447)
Ki 260±n/a nM
Citation Wang, GNikolovska-Coleska, ZYang, CYWang, RTang, GGuo, JShangary, SQiu, SGao, WYang, DMeagher, JStuckey, JKrajewski, KJiang, SRoller, PPAbaan, HOTomita, YWang, S Structure-based design of potent small-molecule inhibitors of anti-apoptotic Bcl-2 proteins. J Med Chem49:6139-42 (2006) 
 
Induced myeloid leukemia cell differentiation protein Mcl-1
Name:Induced myeloid leukemia cell differentiation protein Mcl-1
Type:Membrane; Single-pass membrane protein
Mol. Mass.:37332.87
Organism:Homo sapiens (Human)
Description:Q07820
Residue:350
BDBM50196032
NameBDBM50196032
Synonyms:(N-[(2-tert-butylbenzenesulfonyl)phenyl]-2,3,4-trihydroxy-5-(2-isopropylbenzyl)benzamide N-[(2-tert-butyl-benzenesulfonyl)-phenyl]-2,3,4-trihydroxy-5-(2-isopropyl-benzyl)-benzamide | TW-37
TypeSmall organic molecule
Emp. Form.C33H35NO6S
Mol. Mass.573.699
SMILESCC(C)c1ccccc1Cc1cc(C(=O)Nc2ccc(cc2)S(=O)(=O)c2ccccc2C(C)(C)C)c(O)c(O)c1O