Reaction Details
TargetGonadotropin-releasing hormone receptor
LigandBDBM50133840
Substrate/Competitorn/a
Meas. Tech.ChEMBL_411202 (CHEMBL907222)
IC50 1500±n/a nM
Citation Betz, SFLio, FMGao, YReinhart, GJGuo, ZMesleh, MFZhu, YFStruthers, RS Determination of the binding mode of thienopyrimidinedione antagonists to the human gonadotropin releasing hormone receptor using structure-activity relationships, site-directed mutagenesis, and homology modeling. J Med Chem49:6170-6 (2006) 
 
Gonadotropin-releasing hormone receptor
Name:Gonadotropin-releasing hormone receptor
Type:Enzyme
Mol. Mass.:37749.45
Organism:Homo sapiens (Human)
Description:P30968
Residue:328
BDBM50133840
NameBDBM50133840
Synonyms:1-(2,6-difluorobenzyl)-6-(4-aminophenyl)-5-((benzyl(methyl)amino)methyl)-3-phenylthieno[2,3-d]pyrimidine-2,4(1H,3H)-dione CHEMBL332138
TypeSmall organic molecule
Emp. Form.C34H28F2N4O2S
Mol. Mass.594.674
SMILESCN(Cc1c(sc2n(Cc3c(F)cccc3F)c(=O)n(-c3ccccc3)c(=O)c12)-c1ccc(N)cc1)Cc1ccccc1