Reaction Details
TargetGonadotropin-releasing hormone receptor
LigandBDBM50122652
Substrate/Competitorn/a
Meas. Tech.ChEMBL_411201 (CHEMBL907221)
IC50 1±n/a nM
Citation Betz, SFLio, FMGao, YReinhart, GJGuo, ZMesleh, MFZhu, YFStruthers, RS Determination of the binding mode of thienopyrimidinedione antagonists to the human gonadotropin releasing hormone receptor using structure-activity relationships, site-directed mutagenesis, and homology modeling. J Med Chem49:6170-6 (2006) 
 
Gonadotropin-releasing hormone receptor
Name:Gonadotropin-releasing hormone receptor
Type:Enzyme
Mol. Mass.:37749.45
Organism:Homo sapiens (Human)
Description:P30968
Residue:328
BDBM50122652
NameBDBM50122652
Synonyms:1-(4-(1-(2,6-difluorobenzyl)-5-((benzyl(methyl)amino)methyl)-2,4-dioxo-3-phenyl-1,2,3,4-tetrahydrothieno[2,3-d]pyrimidin-6-yl)phenyl)-3-ethylurea 1-{4-[5-[(Benzyl-methyl-amino)-methyl]-1-(2,6-difluoro-benzyl)-2,4-dioxo-3-phenyl-1,2,3,4-tetrahydro-thieno[2,3-d]pyrimidin-6-yl]-phenyl}-3-ethyl-urea; HCL.1.5H2O | CHEMBL435167
TypeSmall organic molecule
Emp. Form.C37H33F2N5O3S
Mol. Mass.665.751
SMILESCCNC(=O)Nc1ccc(cc1)-c1sc2n(Cc3c(F)cccc3F)c(=O)n(-c3ccccc3)c(=O)c2c1CN(C)Cc1ccccc1