Reaction Details
TargetGonadotropin-releasing hormone receptor
LigandBDBM50133849
Substrate/Competitorn/a
Meas. Tech.ChEMBL_411206 (CHEMBL907226)
IC50 160±n/a nM
Citation Betz, SFLio, FMGao, YReinhart, GJGuo, ZMesleh, MFZhu, YFStruthers, RS Determination of the binding mode of thienopyrimidinedione antagonists to the human gonadotropin releasing hormone receptor using structure-activity relationships, site-directed mutagenesis, and homology modeling. J Med Chem49:6170-6 (2006) 
 
Gonadotropin-releasing hormone receptor
Name:Gonadotropin-releasing hormone receptor
Type:Enzyme
Mol. Mass.:37749.45
Organism:Homo sapiens (Human)
Description:P30968
Residue:328
BDBM50133849
NameBDBM50133849
Synonyms:CHEMBL332355 N-{4-[5-[(Benzyl-methyl-amino)-methyl]-1-(2,6-difluoro-benzyl)-2,4-dioxo-3-phenyl-1,2,3,4-tetrahydro-thieno[2,3-d]pyrimidin-6-yl]-phenyl}-acetamide
TypeSmall organic molecule
Emp. Form.C36H30F2N4O3S
Mol. Mass.636.71
SMILESCN(Cc1c(sc2n(Cc3c(F)cccc3F)c(=O)n(-c3ccccc3)c(=O)c12)-c1ccc(NC(C)=O)cc1)Cc1ccccc1