Reaction Details
TargetCholecystokinin receptor type A
LigandBDBM50196150
Substrate/Competitorn/a
Meas. Tech.ChEMBL_418718 (CHEMBL913512)
Ki>10000±n/a nM
Citation Allison, BDPhuong, VKMcAtee, LCRosen, MMorton, MPrendergast, CBarrett, TLagaud, GFreedman, JLi, LWu, XVenkatesan, HPippel, MWoods, CRizzolio, MCHack, MHoey, KDeng, XKing, CShankley, NPRabinowitz, MH Identification and optimization of anthranilic sulfonamides as novel, selective cholecystokinin-2 receptor antagonists. J Med Chem49:6371-90 (2006) 
 
Cholecystokinin receptor type A
Name:Cholecystokinin receptor type A
Type:G Protein-Coupled Receptor (GPCR)
Mol. Mass.:47859.34
Organism:Homo sapiens (Human)
Description:Stable expression of human CCK-1 receptors in HEK 293 cells.
Residue:428
BDBM50196150
NameBDBM50196150
Synonyms:4-[4-fluoro-2-[(5-quinoxalinylsulfonyl)amino]benzoyl]-morpholine | CHEMBL384854
TypeSmall organic molecule
Emp. Form.C19H17FN4O4S
Mol. Mass.416.426
SMILESFc1ccc(C(=O)N2CCOCC2)c(NS(=O)(=O)c2cccc3nccnc23)c1