Reaction Details
TargetThyrotropin-releasing hormone receptor
LigandBDBM50072394
Substrate/Competitorn/a
Meas. Tech.ChEMBL_431931 (CHEMBL917826)
Ki 20±n/a nM
Citation Kaur, NMonga, VLu, XGershengorn, MCJain, R Modifications of the pyroglutamic acid and histidine residues in thyrotropin-releasing hormone (TRH) yield analogs with selectivity for TRH receptor type 2 over type 1. Bioorg Med Chem15:433-43 (2006) 
 
Thyrotropin-releasing hormone receptor
Name:Thyrotropin-releasing hormone receptor
Type:PROTEIN
Mol. Mass.:45093.48
Organism:Homo sapiens (Human)
Description:ChEMBL_431933
Residue:398
BDBM50072394
NameBDBM50072394
Synonyms:1-[3-(1H-4-imidazolyl)-2-(5-oxotetrahydro-1H-2-pyrrolylcarboxamido)propanoyl]tetrahydro-1H-2-pyrrolecarboxamide ABBOTT-38579 | PROTIRELIN
TypeSmall organic molecule
Emp. Form.C16H22N6O4
Mol. Mass.362.3837
SMILESNC(=O)[C@@H]1CCCN1C(=O)[C@H](Cc1cnc[nH]1)NC(=O)[C@@H]1CCC(=O)N1