Reaction Details
TargetThyrotropin-releasing hormone receptor
LigandBDBM50196459
Substrate/Competitorn/a
Meas. Tech.ChEMBL_431931 (CHEMBL917826)
Ki>100000±n/a nM
Citation Kaur, NMonga, VLu, XGershengorn, MCJain, R Modifications of the pyroglutamic acid and histidine residues in thyrotropin-releasing hormone (TRH) yield analogs with selectivity for TRH receptor type 2 over type 1. Bioorg Med Chem15:433-43 (2006) 
 
Thyrotropin-releasing hormone receptor
Name:Thyrotropin-releasing hormone receptor
Type:PROTEIN
Mol. Mass.:45093.48
Organism:Homo sapiens (Human)
Description:ChEMBL_431933
Residue:398
BDBM50196459
NameBDBM50196459
Synonyms:(2S)-1-[(2S)-2-(2S)-6-oxohexahydro-2-pyridinylcarboxamido]-3-(2-tert-butyl-1H-imidazolyl)propanoyl]-azalone-2-carboxamide | CHEMBL224655
TypeSmall organic molecule
Emp. Form.C21H32N6O4
Mol. Mass.432.5166
SMILESCC(C)(C)c1ncc(C[C@H](NC(=O)[C@@H]2CCCC(=O)N2)C(=O)N2CCC[C@H]2C(N)=O)[nH]1