Reaction Details
TargetTelomerase reverse transcriptase
LigandBDBM50196492
Substrate/Competitorn/a
Meas. Tech.ChEMBL_432005 (CHEMBL918789)
IC50 60±n/a nM
Citation Sissi, CLucatello, LPaul Krapcho, AMaloney, DJBoxer, MBCamarasa, MVPezzoni, GMenta, EPalumbo, M Tri-, tetra- and heptacyclic perylene analogues as new potential antineoplastic agents based on DNA telomerase inhibition. Bioorg Med Chem15:555-62 (2006) 
 
Telomerase reverse transcriptase
Name:Telomerase reverse transcriptase
Type:PROTEIN
Mol. Mass.:127099.03
Organism:Homo sapiens (Human)
Description:ChEMBL_1447029
Residue:1132
BDBM50196492
NameBDBM50196492
Synonyms:2,9-bis-[2-(2-hydroxy-ethylamino)-ethyl]-anthra[2,1,9-def;6,5,10-d'e'f']diisoquinoline-1,3,8,10-tetraone | CHEMBL225205
TypeSmall organic molecule
Emp. Form.C32H28N4O6
Mol. Mass.564.5879
SMILESOCCNCCn1c(=O)c2ccc3c4ccc5c6c(ccc(c7ccc(c2c37)c1=O)c46)c(=O)n(CCNCCO)c5=O