Reaction Details
TargetAdenosine receptor A3
LigandBDBM50196548
Substrate/Competitorn/a
Meas. Tech.ChEMBL_440719 (CHEMBL889816)
Ki 4±n/a nM
Citation Elzein, EKalla, RLi, XPerry, TMarquart, TMicklatcher, MLi, YWu, YZeng, DZablocki, J N6-Cycloalkyl-2-substituted adenosine derivatives as selective, high affinity adenosine A1 receptor agonists. Bioorg Med Chem Lett17:161-6 (2006) 
 
Adenosine receptor A3
Name:Adenosine receptor A3
Type:G Protein-Coupled Receptor (GPCR)
Mol. Mass.:36197.32
Organism:Homo sapiens (Human)
Description:P0DMS8
Residue:318
BDBM50196548
NameBDBM50196548
Synonyms:CHEMBL231881 | N-(4-chlorobenzyl)-1-(9-((2R,3R,4S,5R)-3,4-dihydroxy-5-(hydroxymethyl)-tetrahydrofuran-2-yl)-6-((R)-tetrahydrofuran-2-ylamino)-9H-purin-2-yl)-1H-pyrazole-4-carboxamide
TypeSmall organic molecule
Emp. Form.C25H27ClN8O6
Mol. Mass.570.985
SMILESOC[C@H]1O[C@H]([C@H](O)[C@@H]1O)n1cnc2c(N[C@H]3CCCO3)nc(nc12)-n1cc(cn1)C(=O)NCc1ccc(Cl)cc1