Reaction Details
TargetAdenosine receptor A1
LigandBDBM50196543
Substrate/Competitorn/a
Meas. Tech.ChEMBL_440718 (CHEMBL889815)
Ki 1±n/a nM
Citation Elzein, EKalla, RLi, XPerry, TMarquart, TMicklatcher, MLi, YWu, YZeng, DZablocki, J N6-Cycloalkyl-2-substituted adenosine derivatives as selective, high affinity adenosine A1 receptor agonists. Bioorg Med Chem Lett17:161-6 (2006) 
 
Adenosine receptor A1
Name:Adenosine receptor A1
Type:G Protein-Coupled Receptor (GPCR)
Mol. Mass.:36520.92
Organism:Homo sapiens (Human)
Description:P30542
Residue:326
BDBM50196543
NameBDBM50196543
Synonyms:1-(6-(bicyclo[2.2.1]heptan-1-ylamino)-9-((2R,3R,4S,5R)-3,4-dihydroxy-5-(hydroxymethyl)-tetrahydrofuran-2-yl)-9H-purin-2-yl)-1H-pyrazole-4-carboxylic acid | CHEMBL394221
TypeSmall organic molecule
Emp. Form.C21H25N7O6
Mol. Mass.471.4665
SMILESOC[C@H]1O[C@H]([C@H](O)[C@@H]1O)n1cnc2c(NC34CCC(CC3)C4)nc(nc12)-n1cc(cn1)C(O)=O