Reaction Details
TargetHistone deacetylase 1
LigandBDBM50196599
Substrate/Competitorn/a
Meas. Tech.ChEMBL_422105 (CHEMBL907102)
IC50 70±n/a nM
Citation Marson, CMMahadevan, TDines, JSengmany, SMorrell, JMAlao, JPJoel, SPVigushin, DMCharles Coombes, R Structure-activity relationships of aryloxyalkanoic acid hydroxyamides as potent inhibitors of histone deacetylase. Bioorg Med Chem Lett17:136-41 (2006) 
 
Histone deacetylase 1
Name:Histone deacetylase 1
Type:Enzyme
Mol. Mass.:55090.27
Organism:Homo sapiens (Human)
Description:Q13547
Residue:482
BDBM50196599
NameBDBM50196599
Synonyms:7-(3-fluoro-4-((3-hydroxy-5-(hydroxymethyl)-2-methylpyridin-4-yl)methylamino)phenoxy)-N-hydroxyheptanamide | CHEMBL217263
TypeSmall organic molecule
Emp. Form.C21H28FN3O5
Mol. Mass.421.4625
SMILESCc1ncc(CO)c(CNc2ccc(OCCCCCCC(=O)NO)cc2F)c1O