Reaction Details
TargetHistone deacetylase 1
LigandBDBM50196604
Substrate/Competitorn/a
Meas. Tech.ChEMBL_422105 (CHEMBL907102)
IC50 0.90±n/a nM
Citation Marson, CMMahadevan, TDines, JSengmany, SMorrell, JMAlao, JPJoel, SPVigushin, DMCharles Coombes, R Structure-activity relationships of aryloxyalkanoic acid hydroxyamides as potent inhibitors of histone deacetylase. Bioorg Med Chem Lett17:136-41 (2006) 
 
Histone deacetylase 1
Name:Histone deacetylase 1
Type:Enzyme
Mol. Mass.:55090.27
Organism:Homo sapiens (Human)
Description:Q13547
Residue:482
BDBM50196604
NameBDBM50196604
Synonyms:CHEMBL217083 | N-hydroxy-7-(naphthalen-2-yloxy)heptanamide
TypeSmall organic molecule
Emp. Form.C17H21NO3
Mol. Mass.287.3535
SMILESONC(=O)CCCCCCOc1ccc2ccccc2c1