Reaction Details
TargetHistone deacetylase 1
LigandBDBM50196608
Substrate/Competitorn/a
Meas. Tech.ChEMBL_422105 (CHEMBL907102)
IC50 2±n/a nM
Citation Marson, CMMahadevan, TDines, JSengmany, SMorrell, JMAlao, JPJoel, SPVigushin, DMCharles Coombes, R Structure-activity relationships of aryloxyalkanoic acid hydroxyamides as potent inhibitors of histone deacetylase. Bioorg Med Chem Lett17:136-41 (2006) 
 
Histone deacetylase 1
Name:Histone deacetylase 1
Type:Enzyme
Mol. Mass.:55090.27
Organism:Homo sapiens (Human)
Description:Q13547
Residue:482
BDBM50196608
NameBDBM50196608
Synonyms:7-(4-((4-chlorobenzyl)(methyl)amino)phenoxy)-N-hydroxyheptanamide | CHEMBL217154
TypeSmall organic molecule
Emp. Form.C21H27ClN2O3
Mol. Mass.390.904
SMILESCN(Cc1ccc(Cl)cc1)c1ccc(OCCCCCCC(=O)NO)cc1